Participant,Timestamp,Please do not change. This field is auto-populated by the PGP and identifies which participant you are.,Are you currently ill with a cold or flu-like illness? ,"Since Jan 1, 2020, have you been ill with a cold or flu-like illness?  ",Currently are you experiencing ANY of the above list of symptoms?,"Indicate which of the following symptoms you are currently experiencing.   [Persistent high fever of 38°C (100.4°F) or higher, lasting for a day or more]","Indicate which of the following symptoms you are currently experiencing.   [Feeling cold, chills or shivers]",Indicate which of the following symptoms you are currently experiencing.   [Headache],Indicate which of the following symptoms you are currently experiencing.   [Aches all over the body],Indicate which of the following symptoms you are currently experiencing.   [Cough],Indicate which of the following symptoms you are currently experiencing.   [Rapid breathing],Indicate which of the following symptoms you are currently experiencing.   [Shortness of breath],Indicate which of the following symptoms you are currently experiencing.   [Wheezing or chest tightness],Indicate which of the following symptoms you are currently experiencing.   [Persistent pain or pressure in the chest],Indicate which of the following symptoms you are currently experiencing.   [Bluish lips or face],Indicate which of the following symptoms you are currently experiencing.   [Dizziness],Indicate which of the following symptoms you are currently experiencing.   [Confusion or inability to arouse],Indicate which of the following symptoms you are currently experiencing.   [Running nose],Indicate which of the following symptoms you are currently experiencing.   [Sore throat],Indicate which of the following symptoms you are currently experiencing.   [Nausea],Indicate which of the following symptoms you are currently experiencing.   [Vomiting],Indicate which of the following symptoms you are currently experiencing.   [Abdominal Pain],Indicate which of the following symptoms you are currently experiencing.   [Diarrhea],Indicate which of the following symptoms you are currently experiencing.   [Pink eye (conjunctivitis)],Indicate which of the following symptoms you are currently experiencing.   [Loss of sense of smell],Indicate which of the following symptoms you are currently experiencing.   [Loss of sense of taste],"In the past two weeks, have you experienced ANY of the above list of symptoms?","In the past 2 weeks,  which symptoms have you experienced. [Persistent high fever of 38°C (100.4°F) or higher, lasting for a day or more]","In the past 2 weeks,  which symptoms have you experienced. [Feeling cold, chills or shivers]","In the past 2 weeks,  which symptoms have you experienced. [Headache]","In the past 2 weeks,  which symptoms have you experienced. [Aches all over the body]","In the past 2 weeks,  which symptoms have you experienced. [Cough]","In the past 2 weeks,  which symptoms have you experienced. [Rapid breathing]","In the past 2 weeks,  which symptoms have you experienced. [Shortness of breath]","In the past 2 weeks,  which symptoms have you experienced. [Wheezing or chest tightness]","In the past 2 weeks,  which symptoms have you experienced. [Persistent pain or pressure in the chest]","In the past 2 weeks,  which symptoms have you experienced. [Bluish lips or face]","In the past 2 weeks,  which symptoms have you experienced. [Dizziness]","In the past 2 weeks,  which symptoms have you experienced. [Confusion or inability to arouse]","In the past 2 weeks,  which symptoms have you experienced. [Running nose]","In the past 2 weeks,  which symptoms have you experienced. [Sore throat]","In the past 2 weeks,  which symptoms have you experienced. [Nausea]","In the past 2 weeks,  which symptoms have you experienced. [Vomiting]","In the past 2 weeks,  which symptoms have you experienced. [Abdominal pain]","In the past 2 weeks,  which symptoms have you experienced. [Diarrhea]","In the past 2 weeks,  which symptoms have you experienced. [Pink eye (conjunctivitis)]","In the past 2 weeks,  which symptoms have you experienced. [Loss of sense of smell]","In the past 2 weeks,  which symptoms have you experienced. [Loss of sense of taste]","Since Jan 1, 2020, to the best of your recollection,have you experienced ANY of the above list of symptoms?","Since Jan 1, 2020, to the best of your recollection which symptoms have you experienced. [Persistent high fever of 38°C (100.4°F) or higher, lasting for a day or more]","Since Jan 1, 2020, to the best of your recollection which symptoms have you experienced. [Feeling cold, chills or shivers]","Since Jan 1, 2020, to the best of your recollection which symptoms have you experienced. [Headache]","Since Jan 1, 2020, to the best of your recollection which symptoms have you experienced. [Aches all over the body]","Since Jan 1, 2020, to the best of your recollection which symptoms have you experienced. [Cough]","Since Jan 1, 2020, to the best of your recollection which symptoms have you experienced. [Rapid breathing]","Since Jan 1, 2020, to the best of your recollection which symptoms have you experienced. [Shortness of breath]","Since Jan 1, 2020, to the best of your recollection which symptoms have you experienced. [Wheezing or chest tightness]","Since Jan 1, 2020, to the best of your recollection which symptoms have you experienced. [Persistent pain or pressure in the chest]","Since Jan 1, 2020, to the best of your recollection which symptoms have you experienced. [Bluish lips or face]","Since Jan 1, 2020, to the best of your recollection which symptoms have you experienced. [Dizziness]","Since Jan 1, 2020, to the best of your recollection which symptoms have you experienced. [Confusion or inability to arouse]","Since Jan 1, 2020, to the best of your recollection which symptoms have you experienced. [Running nose]","Since Jan 1, 2020, to the best of your recollection which symptoms have you experienced. [Sore throat]","Since Jan 1, 2020, to the best of your recollection which symptoms have you experienced. [Nausea]","Since Jan 1, 2020, to the best of your recollection which symptoms have you experienced. [Vomiting]","Since Jan 1, 2020, to the best of your recollection which symptoms have you experienced. [Abdominal pain]","Since Jan 1, 2020, to the best of your recollection which symptoms have you experienced. [Diarrhea]","Since Jan 1, 2020, to the best of your recollection which symptoms have you experienced. [Pink eye (conjunctivitis)]","Since Jan 1, 2020, to the best of your recollection which symptoms have you experienced. [Loss of sense of smell]","Since Jan 1, 2020, to the best of your recollection which symptoms have you experienced. [Loss of sense of taste]",Are you regularly taking any of the following medications? Please choose all those that apply.,Have you been tested for coronavirus (COVID-19) by a medical doctor or other official testing service?,"In the past 4 weeks, have you been in close contact with a person who has tested positive for coronavirus (COVID-19)?",How long ago was your contact with a person who has tested positive for coronavirus (COVID-19)?,"In the past 4 weeks, have you been in close contact with a person who has symptoms consistent with coronavirus (COVID-19) but has not been tested?",How long ago was your contact with a person who has symptoms consistent with coronavirus (COVID-19) but has not been tested?
huFD847C,4/13/2020 17:45:10,4eqygbo05xp1rmv3z36peoub81mcrfp8py438ij8t6c8ix4td9,No,Yes,No,,,,,,,,,,,,,,,,,,,,,,No,,,,,,,,,,,,,,,,,,,,,,Yes,No,Yes,Yes,Yes,Yes,No,Yes,Yes,Yes,No,Yes,No,No,Yes,Yes,No,Yes,No,No,No,No,None of these medications,"No, I tried to get tested but could not get a test",No,,No,
hu1E9A18,4/13/2020 17:45:37,48emyiztxpoqg2lxsqijvr7mk3buhgins529vjpfdlq4iep3rv,No,No,No,,,,,,,,,,,,,,,,,,,,,,No,,,,,,,,,,,,,,,,,,,,,,No,,,,,,,,,,,,,,,,,,,,,,None of these medications,"No, I have not tried to get tested",No,,No,
hu264A0A,4/13/2020 17:46:24,4s7rmspi4qyafrp5ob3sj213j14r837cob2ffvd528n64jmr3a,No,Yes,No,,,,,,,,,,,,,,,,,,,,,,No,,,,,,,,,,,,,,,,,,,,,,Yes,No,Yes,Yes,Yes,No,No,No,No,No,No,No,No,No,No,Yes,No,Yes,Yes,No,No,No,None of these medications,"No, I have not tried to get tested",No,,No,
hu8A5FBF,4/13/2020 17:46:43,5g5dixsd7i5df5cd6sm7rs4m5nlg3eq41y45p1uwlqw38f1z3o,No,No,No,,,,,,,,,,,,,,,,,,,,,,No,,,,,,,,,,,,,,,,,,,,,,No,,,,,,,,,,,,,,,,,,,,,,None of these medications,"No, I have not tried to get tested",No,,No,
hu4B0812,4/13/2020 17:47:26,1lux2blj6vqripex7vkwwe6aaewjzzp2hmbsb8o7jd14ax0zg2,No,Unknown,No,,,,,,,,,,,,,,,,,,,,,,No,,,,,,,,,,,,,,,,,,,,,,Yes,No,No,Yes,Yes,Yes,Yes,Yes,Yes,Yes,No,Yes,No,No,Yes,No,No,No,Yes,No,No,No,Atorvastatin,"No, I have not tried to get tested",Yes,In current contact,No,
huE24522,4/13/2020 17:47:31,2ryneh7i6saxkhkc1nfwl0vtomjytwj4pnub9ysm9vg0qarhtv,No,No,No,,,,,,,,,,,,,,,,,,,,,,No,,,,,,,,,,,,,,,,,,,,,,No,,,,,,,,,,,,,,,,,,,,,,None of these medications,"No, I have not tried to get tested",No,,No,
huA3BBD3,4/13/2020 17:47:42,6anrehto2y5gj5mdctot97xy2pbw77k9e0jmwjayv97q38tg5s,No,No,No,,,,,,,,,,,,,,,,,,,,,,No,,,,,,,,,,,,,,,,,,,,,,No,,,,,,,,,,,,,,,,,,,,,,None of these medications,"No, I have not tried to get tested",No,,No,
hu826BC6,4/13/2020 17:47:59,zht1mza76bbpy5a1jtyslt86gx8kklnhmxb8jkcj83rg6urdk,No,No,No,,,,,,,,,,,,,,,,,,,,,,No,,,,,,,,,,,,,,,,,,,,,,No,,,,,,,,,,,,,,,,,,,,,,None of these medications,"No, I have not tried to get tested",No,,No,
hu433D3A,4/13/2020 17:48:04,4giw4nzi5t4ol1si0037l0y6py5aw4zz6f8upb2oxjysb046wx,No,Unknown,No,,,,,,,,,,,,,,,,,,,,,,Yes,No,No,No,No,No,No,No,No,No,No,No,No,No,No,No,No,Yes,Yes,No,No,No,Yes,No,No,No,No,Yes,No,No,No,No,No,No,No,Yes,No,No,No,Yes,Yes,,No,No,None of these medications,"No, I have not tried to get tested",No,,No,
hu781EE2,4/13/2020 17:48:17,gilugf3t9ohbk8yowuv2xy1w7ykzhlv47isy3b2w79ijk25k1,No,Yes,No,,,,,,,,,,,,,,,,,,,,,,No,,,,,,,,,,,,,,,,,,,,,,Yes,No,Yes,Yes,Yes,No,No,No,No,No,No,No,No,No,No,No,No,No,No,No,No,No,None of these medications,"No, I have not tried to get tested",No,,No,
hu26B551,4/13/2020 17:48:36,2rrps0enenep3e8dathp0m7tyxj4bw7fr8k2p7nqcf8zrhnjt4,No,No,No,,,,,,,,,,,,,,,,,,,,,,No,,,,,,,,,,,,,,,,,,,,,,No,,,,,,,,,,,,,,,,,,,,,,,"No, I have not tried to get tested",No,,No,
huE246B7,4/13/2020 17:48:58,4fbmledrcmz1947d8fdkrchg7sfdp7z00bes2mar8pick69vxr,No,No,No,,,,,,,,,,,,,,,,,,,,,,No,,,,,,,,,,,,,,,,,,,,,,No,,,,,,,,,,,,,,,,,,,,,,None of these medications,"No, I have not tried to get tested",No,,Yes,1-2 hours
hu2C1D94,4/13/2020 17:49:28,2uv70d46eo1f1k6cg5510qbj2lvwwuix94jppmarqiaphxj5t6,No,No,No,,,,,,,,,,,,,,,,,,,,,,No,,,,,,,,,,,,,,,,,,,,,,No,,,,,,,,,,,,,,,,,,,,,,None of these medications,"No, I have not tried to get tested",No,,No,
hu04F220,4/13/2020 17:49:31,1t247843p072mv7irvk7muyx41zvafr40hv8s3rhe6w212fxnv,No,No,No,,,,,,,,,,,,,,,,,,,,,,No,,,,,,,,,,,,,,,,,,,,,,No,,,,,,,,,,,,,,,,,,,,,,None of these medications,"No, I have not tried to get tested",No,,No,
hu904B18,4/13/2020 17:49:49,3pir98wbbc6e42z22f4kc8t56vlt8figcdmajc3zp7zv00rvi0,No,Yes,Yes,No,No,No,No,No,No,No,No,No,No,No,No,Yes,No,No,No,No,No,No,No,No,Yes,No,No,No,No,No,No,No,No,No,No,No,No,Yes,No,No,No,No,No,No,No,No,Yes,Yes,Yes,Yes,Yes,Yes,No,No,No,No,No,No,No,Yes,Yes,No,No,No,Yes,No,No,No,losartan (e.g. Cozaar),"No, I have not tried to get tested",No,,Yes,Over 2 weeks
hu96D41E,4/13/2020 17:49:53,1jh1hyr59scyebve98gr2psqtgoau9qexuoib2w9ilhkttzzs2,No,No,No,,,,,,,,,,,,,,,,,,,,,,No,,,,,,,,,,,,,,,,,,,,,,No,,,,,,,,,,,,,,,,,,,,,,None of these medications,"No, I have not tried to get tested",No,,No,
hu351F8B,4/13/2020 17:50:25,66k6zqskpgeda9z73slz0frl266nvnre8iq7huy0xt7n4tfz9m,No,No,No,,,,,,,,,,,,,,,,,,,,,,Yes,No,No,No,No,Yes,No,No,No,No,No,No,No,No,No,No,No,No,No,No,No,No,Yes,No,No,No,No,Yes,No,No,Yes,No,No,No,No,No,Yes,Yes,No,No,No,No,No,No,None of these medications,"No, I have not tried to get tested",No,,No,
huD4DDF9,4/13/2020 17:50:37,2tricznbn0sq8tzrq5nq1lzmpgn19lchwd09ddn21qujczw5dy,No,Yes,No,,,,,,,,,,,,,,,,,,,,,,No,,,,,,,,,,,,,,,,,,,,,,Yes,No,No,Yes,No,Yes,No,No,No,No,No,No,No,Yes,Yes,No,No,No,No,No,No,No,None of these medications,"No, I have not tried to get tested",No,,No,
hu474D66,4/13/2020 17:50:47,2neb3jw5utuzdnv2xszth2586qdsu4hnebucwgzflhff28jwcg,No,Yes,No,,,,,,,,,,,,,,,,,,,,,,No,,,,,,,,,,,,,,,,,,,,,,Yes,No,Yes,Yes,No,Yes,No,Yes,,No,No,No,No,Yes,Yes,No,No,No,Yes,No,No,No,None of these medications,"No, I have not tried to get tested",No,,No,
hu655EB3,4/13/2020 17:50:56,3buahq4d76974gbh2oc91u5mtla0gujh5luw5a7g8bgbwbxfno,No,No,No,,,,,,,,,,,,,,,,,,,,,,No,,,,,,,,,,,,,,,,,,,,,,No,,,,,,,,,,,,,,,,,,,,,,None of these medications,"No, I have not tried to get tested",No,,No,
hu16C775,4/13/2020 17:51:03,3w2dftr26zrx2ucpcbwjw0rwwf2wpsmsawirlmwo0i9wtj58a0,No,No,No,,,,,,,,,,,,,,,,,,,,,,No,,,,,,,,,,,,,,,,,,,,,,No,,,,,,,,,,,,,,,,,,,,,,,"No, I have not tried to get tested",No,,No,
huD00199,4/13/2020 17:51:15,65kgq3ee0x2vid3lnds4usqn2xnz28xnlthr6tg08rppr18efk,No,No,No,,,,,,,,,,,,,,,,,,,,,,No,,,,,,,,,,,,,,,,,,,,,,No,,,,,,,,,,,,,,,,,,,,,,None of these medications,"No, I have not tried to get tested",No,,No,
hu1206C8,4/13/2020 17:51:22,2nk5x2wup49qtv43myi6nenaqod2prcxnpj5d773vn3trermuu,No,No,Yes,No,No,Yes,No,Yes,No,No,No,No,No,No,No,Yes,No,No,No,No,No,No,No,No,Yes,No,No,Yes,No,Yes,No,No,No,No,No,No,No,Yes,No,No,No,No,No,No,No,No,Yes,No,No,Yes,No,Yes,No,No,No,No,No,No,No,Yes,No,No,No,No,No,No,No,No,None of these medications,"No, I have not tried to get tested",No,,No,
hu263409,4/13/2020 17:51:43,1ius1swvmq199g7nznipi9wqaq7nq95xit5omzyymhvpo3oc1f,No,No,No,,,,,,,,,,,,,,,,,,,,,,No,,,,,,,,,,,,,,,,,,,,,,No,,,,,,,,,,,,,,,,,,,,,,None of these medications,"No, I have not tried to get tested",No,,No,
hu7BE0B4,4/13/2020 17:51:52,3x15cwzehqrdltr4ewvohc3rxxxy6bjh0gsf5pgkdks4a3z139,No,Yes,Yes,No,No,No,No,No,No,No,No,No,No,No,No,No,No,Yes,No,No,No,No,No,No,No,,,,,,,,,,,,,,,,,,,,,,Yes,Yes,,Yes,,Yes,,,,,,,,Yes,Yes,,,,,,,,None of these medications,"No, I have not tried to get tested","come on, there's no testing!!!! please. No way to know. ",,,
hu33894B,4/13/2020 17:51:59,397k9hcy8u4tuopbrgazva5ztrf8wcpmbw32zn4efl10k0a45t,No,No,No,,,,,,,,,,,,,,,,,,,,,,No,,,,,,,,,,,,,,,,,,,,,,No,,,,,,,,,,,,,,,,,,,,,,None of these medications,"No, I have not tried to get tested",No,,No,
hu6E3962,4/13/2020 17:52:05,6udkfuhzc3r04e7fy4sytstpnrkc35ylalp1cio61wwed36l7,No,No,No,,,,,,,,,,,,,,,,,,,,,,No,,,,,,,,,,,,,,,,,,,,,,No,,,,,,,,,,,,,,,,,,,,,,"None of these medications, hydroxychloriquine for RA - 5 years","No, I have not tried to get tested",No,,No,
hu27E03F,4/13/2020 17:52:06,1fik3mur30hnu01t93nvevee87q7jqmpb056wwu5b3elhzdoyn,No,Yes,No,,,,,,,,,,,,,,,,,,,,,,No,,,,,,,,,,,,,,,,,,,,,,Yes,Unknown,Yes,Yes,Yes,Yes,No,Yes,Yes,Yes,No,No,No,Yes,Yes,No,No,No,No,No,No,No,None of these medications,"No, I have not tried to get tested",No,,No,
hu30888B,4/13/2020 17:52:39,1yog9dj68f6woitkwv0d3upnlkgkzgp6hienpy83ee2s09k3wg,No,No,No,,,,,,,,,,,,,,,,,,,,,,No,,,,,,,,,,,,,,,,,,,,,,Yes,No,No,Yes,No,No,No,No,Yes,No,No,Yes,No,Yes,No,No,No,Yes,Yes,No,No,No,Telmisartan (e.g. Micardis),"No, I have not tried to get tested",No,,No,
hu9B1DAD,4/13/2020 17:52:39,69zdnohb2l4gqcunas72sjle3nhg7ecnu5k3663oaxre9dey5o,No,No,No,,,,,,,,,,,,,,,,,,,,,,No,,,,,,,,,,,,,,,,,,,,,,No,,,,,,,,,,,,,,,,,,,,,,None of these medications,"No, I have not tried to get tested",No,,No,
huD0449C,4/13/2020 17:52:52,5cw2fgx97o7v9ktzm1i2om0aejjrkg2kyi7jkf30j6eiu1g2b6,No,Yes,No,,,,,,,,,,,,,,,,,,,,,,No,,,,,,,,,,,,,,,,,,,,,,Yes,,Yes,,,Yes,,,,,,Yes,,Yes,,,,,,,Yes,,None of these medications,"No, I have not tried to get tested",No,,No,
hu70DE1D,4/13/2020 17:52:52,3agxmnhlpfpzqk1u3uh7uzwuyjkd3i34zmyx62eesk5pd3gouw,No,No,No,,,,,,,,,,,,,,,,,,,,,,No,,,,,,,,,,,,,,,,,,,,,,Yes,No,No,Yes,No,No,No,No,No,No,No,No,No,No,Yes,No,No,No,No,No,No,No,,,No,,No,
huD87C64,4/13/2020 17:52:55,thb9dftgpy6jyvb9mnwnfj3z9q985uwwh5dfv97h29ttbuj4v,No,Yes,Yes,No,No,No,No,Yes,No,No,No,No,No,No,No,No,No,No,No,No,No,No,No,No,Yes,No,No,No,No,No,No,No,No,No,No,No,No,Yes,Yes,No,No,No,No,No,No,No,Yes,Yes,Yes,Yes,Yes,Yes,No,No,No,Yes,No,No,No,Yes,Yes,No,No,No,Yes,No,No,No,None of these medications,"Yes, and the test was positive for coronavirus (COVID-19)",No,,No,
huA5BEB9,4/13/2020 17:53:32,2nc9l5l4ggb9tdi3v13s63puliln853xe4uo0szigrqlvajq9e,No,No,No,,,,,,,,,,,,,,,,,,,,,,No,,,,,,,,,,,,,,,,,,,,,,Yes,,,,,Yes,,,,,,,,,Yes,,,,,,,,None of these medications,"No, I have not tried to get tested",No,,No,
hu6F9975,4/13/2020 17:53:52,3k4fqmxs31s3imdsc5pmc30kf51tjex541hxwnw0ys6lqvtb0l,No,No,No,,,,,,,,,,,,,,,,,,,,,,No,,,,,,,,,,,,,,,,,,,,,,Yes,,,Yes,,,,,,,,,,Yes,,,,Yes,Yes,,,,None of these medications,"No, I have not tried to get tested",No,,No,
hu52B7E5,4/13/2020 17:54:02,44f5r0vx9r2k5rt4l2tq0ae0ip53lnyute2ylpbg8wtpmhtv2,No,No,Yes,No,No,No,No,No,No,No,No,No,No,No,No,No,No,No,No,No,Yes,No,No,No,Yes,No,No,No,No,No,No,No,No,No,No,No,No,Yes,No,No,No,No,Yes,No,No,No,Yes,No,No,No,No,No,No,No,No,No,No,No,No,Yes,No,No,No,No,Yes,No,No,No,None of these medications,"No, I have not tried to get tested",No,,No,
hu2CDC82,4/13/2020 17:54:23,w50gewmgwxhpupji12jfmfhqwi190pfpligm7v3b19b3xg6xn,No,Yes,No,,,,,,,,,,,,,,,,,,,,,,No,,,,,,,,,,,,,,,,,,,,,,Yes,No,Yes,Yes,Yes,No,No,No,No,Yes,No,No,No,No,Yes,No,No,No,No,No,No,No,,"Yes, and the test was negative for coronavirus (COVID-19)",No,,No,
hu836D0A,4/13/2020 17:55:26,5dwmu42x6nogz9qizeaakr97nufoomijrx8l2kc8jid8neyy2l,No,Yes,Yes,No,No,Yes,Yes,No,No,No,No,No,No,No,No,Yes,Yes,No,No,No,No,No,No,No,Yes,No,No,Yes,Yes,Yes,No,No,No,No,No,No,No,No,Yes,No,No,No,Yes,,No,No,Yes,Yes,Yes,Yes,Yes,Yes,No,No,No,No,No,No,No,Yes,Yes,No,No,No,Yes,No,No,No,None of these medications,"No, I have not tried to get tested",No,,may have some seasonal allergies symptoms-when snow melts in CO!,
huC5733C,4/13/2020 17:57:10,28a5hzl348xo0zou9306jtehkeuywhrlns56dbzznw40697q0c,No,No,No,,,,,,,,,,,,,,,,,,,,,,No,,,,,,,,,,,,,,,,,,,,,,No,,,,,,,,,,,,,,,,,,,,,,"Valsartan (e.g, Diovan, Prexxartan)","No, I have not tried to get tested",No,,No,
hu9D78A5,4/13/2020 17:57:22,2jqaert62wmif4ta6g1kqzpt92uzbownsnj9inf4gaor35ffh9,No,Yes,No,,,,,,,,,,,,,,,,,,,,,,No,,,,,,,,,,,,,,,,,,,,,,Yes,No,Yes,Yes,No,Yes,No,Yes,No,No,No,No,No,Yes,Yes,No,No,No,No,No,No,No,None of these medications,"No, I tried to get tested but could not get a test",No,,No,
huB3A31B,4/13/2020 17:57:33,3ya7odudluncxas0g59w4k2qazsfu1cakm2i6z3221nvh7ki6r,No,No,No,,,,,,,,,,,,,,,,,,,,,,Yes,No,No,Yes,No,No,No,No,No,No,No,No,No,No,No,Yes,No,No,No,No,No,No,Yes,No,Yes,Yes,No,No,No,No,No,No,No,No,No,Yes,No,Yes,Yes,No,No,No,No,No,,"No, I have not tried to get tested",No,,No,
huA5FD8B,4/13/2020 17:58:26,6c5zqvivlzdvdy2svkxhzwayhj3m1e83z9gd6b008wv8ztnk1l,Unknown,Unknown,Yes,No,No,Yes,Yes,No,No,No,No,No,No,Yes,No,No,No,No,No,No,No,No,No,No,Yes,No,No,Yes,Yes,No,No,No,No,No,No,Yes,Yes,No,No,No,No,No,No,No,No,No,Yes,No,No,Yes,Yes,No,No,No,No,No,No,Yes,Yes,No,No,No,No,No,No,No,No,No,"Ibuprofen (eg. Advil, Midol, Motrin, Motrin IB, Motrin Migraine Pain, Proprinal)","No, I have not tried to get tested",unknown,,,
hu6B4DFF,4/13/2020 17:58:27,3f4pwo9vn7pgceo34pg9j2ghw7qyiuh5z5oocygyd5xq1daogd,No,No,No,,,,,,,,,,,,,,,,,,,,,,No,,,,,,,,,,,,,,,,,,,,,,Yes,No,No,Yes,No,Yes,No,Yes,No,No,No,No,No,Yes,Yes,Yes,No,No,No,No,No,No,Irbesartan (e.g. Avapro),"No, I have not tried to get tested",No,,No,
hu9AE5EE,4/13/2020 17:59:06,so60kam9i15owro1f0ld48tapca7p7g9ufyk8j39kvrz5vfzc,No,No,No,,,,,,,,,,,,,,,,,,,,,,No,,,,,,,,,,,,,,,,,,,,,,No,,,,,,,,,,,,,,,,,,,,,,,"No, I have not tried to get tested",No,,No,
hu6ED94A,4/13/2020 17:59:26,pqetykdcwwdhaan60i9nnfw21tttxczcwn0ldaelipc7e7mlm,No,No,Yes,No,No,Yes,No,No,No,No,No,No,No,No,No,No,No,No,No,No,No,No,No,No,Yes,No,No,Yes,No,No,No,No,No,No,No,No,No,No,No,No,No,No,No,No,No,No,Yes,No,No,Yes,No,No,No,No,No,No,No,No,No,No,No,No,No,No,No,No,No,No,"Ibuprofen (eg. Advil, Midol, Motrin, Motrin IB, Motrin Migraine Pain, Proprinal)","No, I have not tried to get tested",No,,No,
hu382DC2,4/13/2020 18:00:09,v2mipo6w90uudou1j4bzbaa1x0fmwuc5qklzydcdw2uj6yp7j,No,No,No,,,,,,,,,,,,,,,,,,,,,,No,,,,,,,,,,,,,,,,,,,,,,No,,,,,,,,,,,,,,,,,,,,,,"Ibuprofen (eg. Advil, Midol, Motrin, Motrin IB, Motrin Migraine Pain, Proprinal), Synvastatin, Allopurinol, acetomenophen","No, I have not tried to get tested",No,,No,
huA97A34,4/13/2020 18:00:21,civuc1kgg8sz05iku3dfpwkhfd00zansl90394rdme6j64vn5,No,No,No,,,,,,,,,,,,,,,,,,,,,,No,,,,,,,,,,,,,,,,,,,,,,No,,,,,,,,,,,,,,,,,,,,,,None of these medications,"No, I have not tried to get tested",No,,No,
hu728164,4/13/2020 18:00:32,5ybq6xztqdmkuf3827xfi4265qqhgfyrmi65zo4ugyn7tz2wte,No,No,No,,,,,,,,,,,,,,,,,,,,,,No,,,,,,,,,,,,,,,,,,,,,,No,,,,,,,,,,,,,,,,,,,,,,None of these medications,"No, I have not tried to get tested",No,,No,
hu82D4C3,4/13/2020 18:00:42,j8y0fgspwrs6e2wj0x38dovzwrojud9bzshrc5tc71abax7rz,No,No,No,,,,,,,,,,,,,,,,,,,,,,No,,,,,,,,,,,,,,,,,,,,,,No,,,,,,,,,,,,,,,,,,,,,,None of these medications,"No, I have not tried to get tested",No,,No,
hu1B792F,4/13/2020 18:00:56,5ay9vaqg9yioc6wlmpw3ka35o0y4us3v6napesa1wfx5el08sf,No,No,Yes,,,Yes,,,,,,,,,,,,,,Yes,Yes,,,,Yes,,,Yes,,,,,,,,,,,,,,Yes,Yes,,,,Yes,,,Yes,,,,,,,,,,,,,,Yes,Yes,,,,None of these medications,"No, I have not tried to get tested",No,,No,
hu0D1FA1,4/13/2020 18:01:15,2v8x217n4s02chfhx0vwl41p03z1pdbvd4nqrjwplqu225da20,No,No,No,,,,,,,,,,,,,,,,,,,,,,No,,,,,,,,,,,,,,,,,,,,,,Yes,No,No,Yes,No,No,No,No,No,No,No,No,No,No,No,No,No,Yes,No,No,No,No,None of these medications,"No, I have not tried to get tested",No,,No,
hu4D143A,4/13/2020 18:01:37,3dip95acg6gnrpw7hl10p6w3whln7q6v299nwa1vr4mvinc1u0,No,No,No,,,,,,,,,,,,,,,,,,,,,,No,,,,,,,,,,,,,,,,,,,,,,Yes,No,No,Yes,No,Yes,No,Yes,No,Yes,No,No,No,No,No,No,No,No,No,No,No,No,,"No, I have not tried to get tested",No,,No,
hu4BE89C,4/13/2020 18:01:38,31kizv0uimjdzuc1lxi73485i5nmle536gd43kfkdbyp64f62t,No,No,No,,,,,,,,,,,,,,,,,,,,,,Yes,No,No,Yes,No,No,No,No,No,No,No,No,No,No,No,No,No,No,No,No,No,No,Yes,No,No,Yes,No,No,No,No,No,No,No,No,No,No,No,No,No,No,No,No,No,No,None of these medications,"No, I have not tried to get tested",No,,No,
hu171D7C,4/13/2020 18:02:02,78sdpea5xa04xt9tw5yhtajf8705dg836zluzu2haxr22etp5,No,No,No,,,,,,,,,,,,,,,,,,,,,,No,,,,,,,,,,,,,,,,,,,,,,No,,,,,,,,,,,,,,,,,,,,,,None of these medications,"No, I have not tried to get tested",No,,No,
hu50405B,4/13/2020 18:02:53,tapj26iht2rjpsxsiadg0fv720c31xqexb7mlr9n10em4za8b,No,No,No,,,,,,,,,,,,,,,,,,,,,,No,,,,,,,,,,,,,,,,,,,,,,No,,,,,,,,,,,,,,,,,,,,,,None of these medications,"No, I have not tried to get tested",No,,No,
hu00445D,4/13/2020 18:03:00,68azu2am74pd8uf4sa1gbljos5t8q8us8we59d1ml1m2b2famt,No,No,No,,,,,,,,,,,,,,,,,,,,,,No,,,,,,,,,,,,,,,,,,,,,,No,,,,,,,,,,,,,,,,,,,,,,None of these medications,"No, I have not tried to get tested",No,,No,
huFFB09D,4/13/2020 18:03:01,5yrtnmit5ax2mlh1yuex6k51jiq5g766blqqes9qtddeknbruk,No,No,Yes,No,No,No,No,No,No,No,No,No,No,No,No,No,No,No,No,Yes,No,No,No,No,No,,,,,,,,,,,,,,,,,,,,,,Yes,No,No,No,No,No,No,No,No,No,No,No,No,No,No,No,No,Yes,Yes,No,No,No,None of these medications,"No, I have not tried to get tested",No,,No,
hu90257C,4/13/2020 18:03:05,5lsserz6s6v15jgpskfkgdpqm4pvv6r7vqkvpfa72fdps8egm2,No,Yes,No,,,,,,,,,,,,,,,,,,,,,,No,,,,,,,,,,,,,,,,,,,,,,Yes,No,No,No,No,Yes,No,No,No,No,No,No,No,Yes,Yes,No,No,No,No,No,No,No,None of these medications,"No, I have not tried to get tested",No,,No,
hu5AE862,4/13/2020 18:03:24,46v5o31sfchm0ui4hn4jn7wsss7i2a6jime7olmcw0r1c4kk4m,No,No,No,,,,,,,,,,,,,,,,,,,,,,No,,,,,,,,,,,,,,,,,,,,,,No,,,,,,,,,,,,,,,,,,,,,,None of these medications,"No, I have not tried to get tested",No,,No,
huAF3415,4/13/2020 18:03:32,236l5vhp5dtib049dfolmualovgnctcvyprqlutmdew9gpmqex,Yes,Yes,Yes,No,No,No,No,Yes,No,,No,Unknown,No,No,No,Yes,Yes,No,No,No,No,No,No,No,Yes,No,No,No,No,Yes,No,No,No,No,No,No,No,No,Yes,No,No,No,No,No,No,No,Yes,No,No,No,No,Yes,No,No,No,No,No,No,No,Yes,Yes,No,No,No,No,No,No,No,None of these medications,"No, I have not tried to get tested",No,,No,