Participant,Timestamp,Please do not change. This field is auto-populated by the PGP and identifies which participant you are.,What is the zip code of your primary residence? ,Do have another residence where you spend more than 30 days a year?,What is the zip code of your secondary residence (where you spend at least 30 days per year)?,What is your age (in years)?,What is your gender?,Select all the following that apply to your current living arrangements.,What is your race?  Pick all that apply.,What is your ethnicity?,Select which one of the following applies to you and your birth status.,Have you ever been diagnosed with any of the following? [Asthma (Adult)],Have you ever been diagnosed with any of the following? [Asthma (Childhood)],Have you ever been diagnosed with any of the following? [Chronic obstructive pulmonary disease (COPD)],Have you ever been diagnosed with any of the following? [Emphysema],Have you ever been diagnosed with any of the following? [Chronic bronchitis],Have you ever been diagnosed with any of the following? [Pneumonia],Have you ever been diagnosed with any of the following? [Type 1 Diabetes],Have you ever been diagnosed with any of the following? [Type 2 Diabetes],Have you ever smoked tobacco products?,Do you currently smoke tobacco products?,What is the average number of cigarettes (# of cigarettes not packs) you smoke per day?,"Have you ever used e-cigarettes (e.g. JUUL, Vuse, MarkTen)?","Do you currently use e-cigarettes (e.g. JUUL, Vuse, MarkTen) ?","During the past 30 days, during how many days did you use e-cigarettes (e.g. JUUL, Vuse, MarkTen)?",Which one of the following best describes your employment status for the past 3 months?,Select the category that best describes your occupation.,What is the zip code of your primary workplace/worksite?,Do you have a secondary workplace/worksite where you work more than 30 days a year?,What is the zip code of your secondary workplace/worksite (where you work more than 30 days a year)?,"If a vaccine against coronovirus (COVID-19) would reach the stage where it must be tested for safety and efficacy in humans, would you - assuming that you are eligible - be interested in taking part in that trial?"
hu18460C,3/23/2020 16:06:28,4rf413or3yiohvficfuno8cs3e5nnepqf8t9uq08lb6b06jge3,02144,No,,44,Male,Live with partner/spouse,"Asian, East Indian",Not Hispanic or Latino or Spanish Origin,None of the above,No,No,No,No,No,No,No,No,No,,,No,,,Employed: Working 1-39 hrs per week,"Life, Physical, and Social Science",02115,No,,Yes
hu264A0A,3/23/2020 18:37:05,2pzxpbckdp9q2qpqhflm1wlz9nvlstbg6hrdx9u9ep6yll81et,53726,No,,54,Female,Live with partner/spouse,White,Not Hispanic or Latino or Spanish Origin,None of the above,Yes,No,No,No,No,No,No,No,No,,,No,,,Employed: Working 40 or more hrs per week,"Life, Physical, and Social Science",53706,No,,Maybe
hu63EB0A,3/23/2020 18:37:10,5n9z9tq03fk75wz80mq0cub5w2z5kbzqld29j8gjxglby68r18,30319,No,,50,Male,"Live with partner/spouse, Live with child/children under age 18",White,Not Hispanic or Latino or Spanish Origin,None of the above,No,Yes,No,No,No,No,No,No,Yes,No,Don't currently smoke,No,,,Employed: Working 40 or more hrs per week,"Life, Physical, and Social Science",30314,No,,Yes
hu2C1D94,3/23/2020 18:38:33,1eqtgxrc21hw2o5dbdzewc0g77afeze1ywsfwbxtrrhfprrvsq,89703,No,,37,Male,Live with partner/spouse,White,Not Hispanic or Latino or Spanish Origin,None of the above,No,No,No,No,No,No,No,No,No,,,No,,,Employed: Working 40 or more hrs per week,Legal,89701,No,,Yes
huF80F84,3/23/2020 18:38:46,5qlim21fgg69pq5cqaybqzn2395gh5hccaoi8g39zpvhscylwd,01464,Yes,00000,31,Other,"Live with partner/spouse, Live with roommate(s)",White,Not Hispanic or Latino or Spanish Origin,None of the above,No,No,No,No,No,No,No,No,No,,,No,,,Employed: Working 1-39 hrs per week,"Life, Physical, and Social Science",00000,No,,Maybe
huC5733C,3/23/2020 18:39:26,60vqxmts74hubthvmx5qnxr50bnqtyu1y8rh5p1btawnfs9oz4,11768,No,,64,Male,Live with partner/spouse,White,Not Hispanic or Latino or Spanish Origin,None of the above,No,No,No,No,No,No,No,No,No,,,No,,,Employed: Working 1-39 hrs per week,Educational Instruction and Library,11724,No,,Yes
hu574751,3/23/2020 18:39:46,45pek5echdfb7jlcd65jg3h3alpj4vuoaqll4dyhat0t6idcx2,27701,No,,56,Male,Live with partner/spouse,White,Not Hispanic or Latino or Spanish Origin,None of the above,No,No,No,No,No,No,No,No,No,,,No,,,Employed: Working 40 or more hrs per week,"Life, Physical, and Social Science",27709,No,,Yes
hu5880D9,3/23/2020 18:40:05,2iu6a0c22iiiv857ebn9wx3jzrwtf3rlt3ecgfrmypm1x3um9i,92028,No,,33,Female,"Live with partner/spouse, Live with child/children under age 18",White,Not Hispanic or Latino or Spanish Origin,None of the above,No,No,No,No,No,Yes,No,No,No,,,No,,,Employed: Working 1-39 hrs per week,Office and Administrative Support,92028,No,,Maybe
hu2DC3CE,3/23/2020 18:40:40,al6jeblvzgeuvr0xtvcv4dtf05ajzyuaabu8kumiiu5qcwpq6,94086,No,,33,Female,Live with parent(s),White,Not Hispanic or Latino or Spanish Origin,None of the above,No,No,No,No,No,No,No,No,No,,,No,,,Employed: Working 40 or more hrs per week,Management,94086,Yes,London UK,Yes
huA5FD8B,3/23/2020 18:40:47,2isgowoztezl75q5ln5yk4bv8p90ozqbhxfyq62mqhy2fndg2k,02445,Yes,02445,35,Female,Live alone,"Black or African American, White",Not Hispanic or Latino or Spanish Origin,None of the above,No,No,No,No,No,No,No,No,Yes,No,Don't currently smoke,Yes,No,0,Employed: Working 40 or more hrs per week,"Life, Physical, and Social Science",02142,No,,Yes
hu7D0E75,3/23/2020 18:41:20,22wyp738s9oul79wiaf626063x51wjo1zjolba3lchgvpqafn3,02446,No,,59,Male,Live alone,White,Not Hispanic or Latino or Spanish Origin,None of the above,No,No,No,No,No,No,No,No,No,,,No,,,Retired,,,,,
huFFAD87,3/23/2020 18:41:27,59v2uw5wcm34weg5ierlgeztch8yu3rkq4d6i3jeyq9ldji2ue,02476,No,,47,Male,"Live with partner/spouse, Live with child/children under age 18",White,Not Hispanic or Latino or Spanish Origin,None of the above,No,No,No,No,No,No,No,No,No,,,No,,,Employed: Working 40 or more hrs per week,Computer and Mathematical,02476,No,,Yes
huB63C0C,3/23/2020 18:41:50,1xfbe814xd4rv5rbyn1w8xqvgq6pjluxqs82nwazklowvbxdf5,22206,No,,57,Male,"Live with partner/spouse, Live with child/children under age 18",White,Not Hispanic or Latino or Spanish Origin,None of the above,No,No,No,No,No,No,Yes,No,No,,,No,,,Employed: Working 40 or more hrs per week,Government,20520,No,,Yes
huD5B426,3/23/2020 18:42:18,o3o9z94bw0ztlzxciq30w0g0syiktt1wjsl43t64rvybd0zjq,94509,No,,37,Male,"Live with partner/spouse, Live with child/children under age 18",White,Not Hispanic or Latino or Spanish Origin,None of the above,No,No,No,No,No,No,No,No,No,,,No,,,Employed: Working 40 or more hrs per week,Computer and Mathematical,94509,Yes,95113,Yes
hu01B48A,3/23/2020 18:42:52,6967uaz1v58qdoxgtkusdgnqj0mx9p7lvqy8qmf3ymmvn6c7z3,75206,No,,38,Male,Live alone,White,Not Hispanic or Latino or Spanish Origin,None of the above,No,No,No,No,No,No,No,No,No,,,No,,,Employed: Working 40 or more hrs per week,Sales and Sales Related,75206,No,,Yes
hu4B0812,3/23/2020 18:43:46,e9ixjqm6ts1t0i5zu5c9sgofrebrd4j307ae1ib4pl0fj6hub,01776,No,,50,Male,"Live with partner/spouse, Live with child/children under age 18",White,Not Hispanic or Latino or Spanish Origin,None of the above,Yes,Yes,No,No,No,No,No,No,No,,,No,,,Employed: Working 40 or more hrs per week,Healthcare Support,02453,No,,Yes
hu397733,3/23/2020 18:44:07,377jqkbvhwcrwv85fxrwe0olv3vnusivymecvqiuku0hsu6por,70601,Prefer not to answer,,66,Female,Live with partner/spouse,White,Not Hispanic or Latino or Spanish Origin,None of the above,No,No,No,No,Yes,Yes,No,No,No,,,No,,,Employed: Working 1-39 hrs per week,"Arts, Design, Entertainment, Sports, and Media",70601,Prefer not to answer,,Maybe
hu580BA5,3/23/2020 18:44:26,3i4a4ewgy2m32wqybfpm6gjre69asjjqksbiepa6d6cp8csuht,92612,No,,,Female,"Live with partner/spouse, Live with child/children under age 18",White,Not Hispanic or Latino or Spanish Origin,None of the above,Yes,No,No,No,No,No,No,No,"For a few months, but it was back in 1993.",,,"Not for nicotine, but I do use a cannabis vaporizer that is similar.",,,Stay at home parent of children not old enough for school,,,,,
huFC9066,3/23/2020 18:45:56,2wl2i9yszdr4gl8o87wlwxo911s2syv9jbo9khhzv56ki1zwq2,95821,No,,43,Male,Live alone,White,Not Hispanic or Latino or Spanish Origin,None of the above,No,No,No,No,No,No,No,No,No,,,No,,,Employed: Working 40 or more hrs per week,Computer and Mathematical,95811,No,,Yes
huA9A9EE,3/23/2020 18:46:02,2wrw41f9ab5favydskztbqv1fidsg6ida7y5dxgwrby8s1pr10,75228,Yes,,69,Male,Live with partner/spouse,White,Hispanic or Latino or Spanish Origin,None of the above,No,No,No,No,No,No,No,No,Yes,No,Don't currently smoke,No,,,Employed: Working 40 or more hrs per week,Computer and Mathematical,75211,No,,Yes
hu5CD2C6,3/23/2020 18:46:49,5dtulz4zpn5zh902lwxyoxarmt76qbyk801vqzwdu0j78yxmxx,02451,,,,Female,Live with partner/spouse,White,Not Hispanic or Latino or Spanish Origin,None of the above,No,No,No,No,No,No,No,No,No,,,No,,,Retired,,,,,
hu4B2FD9,3/23/2020 18:46:52,3p9zs6o86vgscy2is2wqa2l01zjwju07f8dzn97c2heky2vqz4,98121,No,,45,Male,Live alone,White,Not Hispanic or Latino or Spanish Origin,None of the above,No,No,No,No,No,Yes,No,Yes,No,,,No,,,Disabled/Not able to work,,,,,
hu96D41E,3/23/2020 18:47:55,5c0qp1l5kir1gkg2okbkqusrhwh01co00dooz1nfki88qjlf9i,49053,No,,56,Male,Live alone,White,Not Hispanic or Latino or Spanish Origin,None of the above,No,No,No,No,No,No,No,No,No,,,No,,,Employed: Working 40 or more hrs per week,Computer and Mathematical,63368,No,,Yes
hu26B551,3/23/2020 18:48:06,th224ie8ddh7zt8v0aqs6a1cspgo1u320ukq0odntuoq43sgn,97202,No,,58,Female,Live with roommate(s),White,Not Hispanic or Latino or Spanish Origin,None of the above,Yes,No,No,No,No,No,No,No,Yes,No,Don't currently smoke,No,,,Employed: Working 1-39 hrs per week,Educational Instruction and Library,97212,No,,Yes
hu34D5B9,3/23/2020 18:48:25,10jolxmpjm29xswruxcxrvp8b2fcchsbp3t4xypykgxi459uv5,02144,No,,47,Other,"Live with partner/spouse, Live with child/children under age 18",White,Not Hispanic or Latino or Spanish Origin,None of the above,Yes,Yes,No,No,No,No,No,No,No,,,No,,,Employed: Working 40 or more hrs per week,"Life, Physical, and Social Science",02144,No,,Yes
hu45A646,3/23/2020 18:48:39,2ovk5c5siyhl8rlkrux2jo8pfx682v4gplksgni3fc8ud55tbi,94920,No,,78,Male,Live with partner/spouse,White,Not Hispanic or Latino or Spanish Origin,None of the above,No,No,No,No,No,No,No,No,Yes,No,Don't currently smoke,No,,,Retired,,,,,
hu0D1FA1,3/23/2020 18:48:43,5u3mfuxe12jnkbmpdfuedxtnouhy4fjwjdsrllscriwgti0h09,06259,No,,48,Female,"Live with partner/spouse, Live with child/children under age 18",White,Not Hispanic or Latino or Spanish Origin,None of the above,No,No,No,No,No,No,No,No,No,,,No,,,Employed: Working 40 or more hrs per week,Educational Instruction and Library,06281,No,,Yes
huEC68B1,3/23/2020 18:49:17,57cdacaa5uozij2b1u9lw9ndexosu3dwuhima1ipe7jtmxjwzi,92104,No,,68,Female,Live alone,White,Not Hispanic or Latino or Spanish Origin,None of the above,No,No,No,No,No,No,No,No,Yes,No,Don't currently smoke,No,,,Retired,,,,,
hu516E89,3/23/2020 18:49:57,4vma68myrww03gvi1s2kvz7wfbn6el3shfvly7y25evdblr2fz,94552,No,,,Male,"Live with partner/spouse, Live with child/children under age 18",White,Not Hispanic or Latino or Spanish Origin,None of the above,No,No,No,No,No,No,No,No,No,,,No,,,Employed: Working 40 or more hrs per week,Computer and Mathematical,94583,No,,Yes
huF38CD2,3/23/2020 18:50:03,b3s3b10oxds4l8u2u6soi22w42vy3nn1l3vmek9und8swkuyz,94702,No,,35,Male,"Live with partner/spouse, Live with child/children under age 18",White,Not Hispanic or Latino or Spanish Origin,None of the above,No,Yes,No,No,No,No,No,No,Prefer not to answer,,,No,,,Employed: Working 40 or more hrs per week,Management,94702,No,,Yes
hu399FC0,3/23/2020 18:50:12,12kvck9d58aksypnrus7iiurlpzv5ogyx3i1fr1oro21hzylb0,90713,No,,69,Male,Live with partner/spouse,White,Not Hispanic or Latino or Spanish Origin,None of the above,No,No,No,No,No,No,No,No,Yes,No,Don't currently smoke,No,,,Retired,,,,,
hu52F345,3/23/2020 18:50:26,4okjb6xx6umuqt9njsvbbrgpd4fw6ilbaz807u2w9nd4zw7o9b,99362,No,,40,Female,"Live with partner/spouse, Live with child/children under age 18, 2 cats",White,Not Hispanic or Latino or Spanish Origin,None of the above,No,No,No,No,No,No,No,No,No,,,No,,,Homemaker and attorney,,,,,
hu25E94B,3/23/2020 18:50:45,60h51fsi8ci9kuae0okblq2wrg43yzs8tk9kuhxugzdo59oiob,87557,No,,52,Female,Live with partner/spouse,White,Not Hispanic or Latino or Spanish Origin,None of the above,No,No,No,No,No,No,No,No,Yes,No,Don't currently smoke,No,,,Employed: Working 1-39 hrs per week,"Arts, Design, Entertainment, Sports, and Media",87557,No,,No
hu35071E,3/23/2020 18:50:46,1mhxxt8h185dhx9fj4iy31vbaveqokubfidilot1043cqrp4el,94116,No,,40,Male,"Live with partner/spouse, Live with child/children under age 18",White,Not Hispanic or Latino or Spanish Origin,None of the above,No,No,No,No,No,No,No,No,No,,,No,,,Not employed: Looking for work,,,,,
hu3DF8AD,3/23/2020 18:50:58,1guvoy3jrcoq17qp2a0x1i0jotpai9newxcmzct4lvfdj89h8f,35243,No,,32,Male,"Live with partner/spouse, Live with child/children under age 18",White,Not Hispanic or Latino or Spanish Origin,None of the above,No,Yes,No,No,No,No,No,No,Yes,No,Don't currently smoke,Yes,No,0,Employed: Working 40 or more hrs per week,Healthcare Practitioners,35294,No,,Yes
huFF7476,3/23/2020 18:51:31,ya94du7ffdrp5jco1fb36t16q6v3oap4jale7rskqznfy35n4,01921,Yes,04255,57,Male,"Live with partner/spouse, live with spouse and college age son when he is not at college ",White,Not Hispanic or Latino or Spanish Origin,None of the above,No,No,No,No,No,No,No,No,No,,,No,,,Not employed: Looking for work,,,,,
hu2E413D,3/23/2020 18:51:34,geu3tlguvrphl7vwqt36xzd1jmuik541fuus2j4s5ht0haijb,63119,No,,,Male,Live with partner/spouse,Northern European ancestry,Not Hispanic or Latino or Spanish Origin,None of the above,No,No,No,No,No,Yes,No,No,No,,,No,,,Employed: Working 40 or more hrs per week,"Life, Physical, and Social Science",62026,Yes,63110,Yes
hu3CAB43,3/23/2020 18:51:45,rrutv7rz8trqk2ijms9ya2vowqsfqlytvn1izvdsl5ny06ng7,30030,No,,52,Male,"Live with partner/spouse, Live with child/children under age 18",White,Not Hispanic or Latino or Spanish Origin,None of the above,No,No,No,No,No,No,No,No,No,,,No,,,Employed: Working 40 or more hrs per week,Computer and Mathematical,30334,No,,Yes
huF9E138,3/23/2020 18:52:15,4g6sd76gcfymhj3chsf2h2yjryssmgmaw2abot3bnbbxn0o1pw,06776,Yes,06019,37,Male,Live alone,White,Not Hispanic or Latino or Spanish Origin,None of the above,Yes,No,No,No,No,No,No,No,No,,,No,,,Employed: Working 40 or more hrs per week,Computer and Mathematical,06776,No,,No
hu8B54DD,3/23/2020 18:52:22,o2whffg0e6fyrjkm8yq4nid5a5cvlflji9gkhuj8efaczft3l,93555,Yes,89436,66,Male,Live with partner/spouse,White,Not Hispanic or Latino or Spanish Origin,None of the above,No,No,No,No,No,No,No,No,Yes,No,Don't currently smoke,No,,,Retired,,,,,
huA14E7B,3/23/2020 18:52:54,140ucn5c8j9q31y9eveklaa120oj0lkgbfeqn02vhqj7b1m4oi,97504,No,,69,Female,Live with partner/spouse,White,Not Hispanic or Latino or Spanish Origin,None of the above,No,No,No,No,No,No,No,No,No,,,No,,,Retired,,,,,
huD37D14,3/23/2020 18:53:05,2el94g00aeunl607nztvb2dcm8oysrx3ewj2iy46499mma4qu1,94523,No,,50,Female,Live with Daughter age 22,White,Not Hispanic or Latino or Spanish Origin,None of the above,Yes,Yes,Unknown,No,Yes,Yes,No,No,Yes,No,Don't currently smoke,I have been using a CBD vape pen sporadically(rarely) for few years,,,Not employed: Looking for work,,,,,
huDD642E,3/23/2020 18:53:06,1tk7pe4colosdcy39t48ppsqw96ftm48nkge4ccbb2ylekzud3,29681,No,,61,Male,"Live with child/children under age 18, Also live with adult autistic son age 31",White,Not Hispanic or Latino or Spanish Origin,None of the above,No,No,No,No,No,No,No,No,No,,,No,,,Employed: Working 1-39 hrs per week,Computer and Mathematical,29681,No,,Yes
huCD380F,3/23/2020 18:53:06,5g7odjo64q9xdf4rgy9ipo2m74o4e2mrcs1ch0uemi1upoy3l5,83713,No,,,Female,Live with child/children under age 18,White,Not Hispanic or Latino or Spanish Origin,None of the above,,,,,,,,,Yes,No,Don't currently smoke,Yes,Yes,5,Employed: Working 40 or more hrs per week,Production,83714,No,,Yes
huFFB09D,3/23/2020 18:53:26,1tkm3qxlkmum9be82540ktbkr52hh866osklpgbos0vefh69fo,94611,No,,53,Female,Live alone,White,Not Hispanic or Latino or Spanish Origin,None of the above,No,No,No,No,No,No,No,No,Yes,No,Don't currently smoke,No,,,Employed: Working 40 or more hrs per week,"Life, Physical, and Social Science",94720,No,,Maybe
hu904B18,3/23/2020 18:53:52,4f09sd6mx52hrth5bun67skzw0k4qiwk396ubqwkgzf53syd7m,16506,No,,69,Male,Live with partner/spouse,White,Not Hispanic or Latino or Spanish Origin,None of the above,Yes,Unknown,No,No,No,No,No,No,No,,,No,,,Employed: Working 1-39 hrs per week,Healthcare Practitioners,16506,No,,Yes
huCA3B39,3/23/2020 18:53:56,244whd2deutiykl0qo8lj3dd7rn3ngfx4mifpxveuz0211h9z0,20853,No,,46,Female,Live with partner/spouse,White,Not Hispanic or Latino or Spanish Origin,None of the above,No,No,No,No,No,No,No,No,No,,,No,,,Employed: Working 40 or more hrs per week,"Arts, Design, Entertainment, Sports, and Media",20817,No,,Yes
hu8F7E17,3/23/2020 18:54:01,4tml80pdz95urwkso50szepyzc6m4ycdrxk4b2fs2t2a0huagr,07079,No,,66,Female,Live with partner/spouse,White,Not Hispanic or Latino or Spanish Origin,None of the above,No,Yes,No,No,No,No,,,No,,,No,,,Retired,,,,,
hu9C207F,3/23/2020 18:55:17,3bkkja73qvd6b1pnl9dcb5y77qr6mae0e5ouc0jde4i66vdh38,30096,No,,31,Female,Live alone,White,Not Hispanic or Latino or Spanish Origin,None of the above,No,No,No,No,No,Yes,No,No,Yes,No,Don't currently smoke,Yes,No,,Employed: Working 40 or more hrs per week,Computer and Mathematical,30096,No,,No
huD554DB,3/23/2020 18:55:45,1zu8r20t0y5oe3shqmo0udo7mmk6vto88ikd95uubogcia1qub,17815,No,,58,Female,"Live with partner/spouse, Other, Son age 28",White,Not Hispanic or Latino or Spanish Origin,None of the above,No,No,No,No,No,No,No,No,Yes,No,Don't currently smoke,No,,,Employed: Working 40 or more hrs per week,Management,17815,No,,Maybe
hu2CDC82,3/23/2020 18:56:27,a4ngffh50kndga4jw3esiyh2l694njiyf2qitityo2bsslj1s,01002,No,,59,Male,"Live with partner/spouse, Live with child/children under age 18",White,,None of the above,No,No,No,No,No,No,No,No,Yes,No,Don't currently smoke,No,,,Not employed: Looking for work,,,,,
hu263CFD,3/23/2020 18:56:30,2vdorhg9c3ouknlx9tcns3gpu2mry9svy1bnchk7al3zriq4kl,40324,No,,46,Male,"Live with partner/spouse, Live with child/children under age 18",White,Not Hispanic or Latino or Spanish Origin,None of the above,Yes,Yes,No,No,Yes,Yes,No,No,No,,,No,,,Employed: Working 40 or more hrs per week,Educational Instruction and Library,40324,No,,Yes
huD0127A,3/23/2020 18:56:35,2fqqqlciw4p90mt5w41gk7z4cc8loebap2okr142nazy2c7nao,20784,Yes,99775,56,Male,Live with partner/spouse,White,Not Hispanic or Latino or Spanish Origin,None of the above,No,No,No,No,No,No,No,No,No,,,No,,,Employed: Working 40 or more hrs per week,geophysicist faculty at University of Alaska,99775,Yes,11000,Yes
hu132B5C,3/23/2020 18:57:25,41db3c3iabghfbp7486ibvq4yb6h6ea6b2r4yrcbbyqbvjjrf4,98059,No but I generally travel more than 30 days a year.,,38,Female,"Live with partner/spouse, Live with grandparent(s), Live with roommate(s)",White,Not Hispanic or Latino or Spanish Origin,None of the above,No,No,No,No,No,No,No,No,No,,,No,,,Employed: Working 1-39 hrs per week,"Arts, Design, Entertainment, Sports, and Media",98208,Yes,30248,Yes
hu04D9CD,3/23/2020 18:57:42,14j78g44fnkqpqzas3vkdakjocuiym7b4d0fn5vax88q05wp0e,10012,No,,30, Trans (MTF),Live with roommate(s),White,Not Hispanic or Latino or Spanish Origin,None of the above,No,No,No,No,No,No,No,No,No,,,No,,,Employed: Working 1-39 hrs per week,Computer and Mathematical,10012,No,,Yes
hu7B4393,3/23/2020 18:57:44,1bedkfafj6p1s47iraoo9cl8vcpvuhouuamsay1i9h743ggmmi,60505,No,,40,Male,Live with partner/spouse,White,Not Hispanic or Latino or Spanish Origin,None of the above,No,No,No,No,No,No,No,No,Yes,No,Don't currently smoke,Yes,No,0,Employed: Working 40 or more hrs per week,Business and Financial Operations,60505,No,,Yes
huD550A5,3/23/2020 18:58:25,yyr7xuzlp6nbo9oqzl9y6ou8y9glc7393dp80w59sjvyb56nr,97214,No,,44,Female,Live alone,Black or African American,Not Hispanic or Latino or Spanish Origin,None of the above,No,No,No,No,No,No,No,No,No,,,No,,,Not employed: Not looking for work,,,,,
hu70DE1D,3/23/2020 18:58:41,radb0vzhbp7upatavbxscu8yhjyme3owyjqygojdvihstiuas,94619,No,,63,Male,Live with partner/spouse,Jewish,Not Hispanic or Latino or Spanish Origin,None of the above,No,No,No,No,No,No,No,No,Yes,No,Don't currently smoke,No,,,Retired,,,,,
hu8229AE,3/23/2020 18:59:35,121a4ik4vngbqz0nr79ksjxjzyyltdgetsav5hc1fd559kdi11,55410,No,,,Female,Live with partner/spouse,White,Not Hispanic or Latino or Spanish Origin,None of the above,No,Yes,No,No,No,No,No,No,No,,,No,,,Employed: Working 40 or more hrs per week,Computer and Mathematical,55435,No,,Yes
hu974CFF,3/23/2020 18:59:37,21mxpo438um25q18qrvptt860djnjvytfkrzef7f1fznchzz35,97038,No,,49,Male,Live alone,White,Not Hispanic or Latino or Spanish Origin,None of the above,No,No,No,No,No,No,No,No,No,,,No,,,Employed: Working 1-39 hrs per week,Educational Instruction and Library,97201,No,,Yes
huAC3902,3/23/2020 18:59:53,35khd531fvytq3hvw201k4m2jyxke9nj5ql1kr98abaeubette,37205,Yes,84060,63,Male,Live with partner/spouse,White,Not Hispanic or Latino or Spanish Origin,None of the above,No,No,No,No,No,No,No,No,Yes,No,Don't currently smoke,No,,,Employed: Working 40 or more hrs per week,Healthcare Practitioners,37203,No,,Yes
hu90B053,3/23/2020 18:59:56,erx25ys0hm3rpe13wipihqe0flly09v5knhr2f5ffugsoukzb,01770,No,,57,Female,"Live with partner/spouse, Live with child 18 years old",White,Not Hispanic or Latino or Spanish Origin,None of the above,No,No,No,No,No,No,No,No,No,,,No,,,Employed: Working 40 or more hrs per week,"Life, Physical, and Social Science",02492,No,,Yes
hu975ADE,3/23/2020 19:00:47,5lxmj3s4etejc4kdkj61rqrfcezb3bai1h5pmpuk3konvf4emh,07066,Yes,08721,36,Male,"Live with partner/spouse, Live with child/children under age 18",White,Not Hispanic or Latino or Spanish Origin,None of the above,No,Yes,No,No,No,No,No,No,No,,,No,,,Employed: Working 40 or more hrs per week,Management,07105,Yes,07066,Maybe
hu36D6B7,3/23/2020 19:01:04,1iat4rcs627tao38r1h03cc4w0pa624swoaxd0a0tju6htfecd,10075,No,,47,Male,Live with partner/spouse,White,Not Hispanic or Latino or Spanish Origin,None of the above,No,No,No,No,No,No,No,No,Yes,No,Don't currently smoke,No,,,Employed: Working 1-39 hrs per week,"Life, Physical, and Social Science",10075,Yes,,Yes
huF7E042,3/23/2020 19:01:11,4cki3wtdtn565ne7txil6ujgk54pjih1q20sz2bctiysjfgrkr,94025,No,,80,Male,Live with partner/spouse,White,Not Hispanic or Latino or Spanish Origin,None of the above,Yes,No,No,No,No,No,No,No,No,,,No,,,Retired,,,,,
hu0EFCEF,3/23/2020 19:01:40,45h8trxu7ill98gkar3r5fy211lbglwzddqaq02upjukuj6qyj,43953,No,,31,Female,Live alone,White,Not Hispanic or Latino or Spanish Origin,None of the above,No,No,No,No,No,Yes,No,No,Yes,No,Don't currently smoke,No,,,Employed: Working 40 or more hrs per week,Healthcare Support,26062,Yes,26003,Yes
huD20DAF,3/23/2020 19:02:15,447vgq2onwhhyr2favgfnczqj3eht5x4ixi5058fzi27kdnmrb,84103,No,,70,Female,Live alone,White,Not Hispanic or Latino or Spanish Origin,None of the above,No,No,No,No,No,Yes,No,No,No,,,No,,,Retired,,,,,
hu826BC6,3/23/2020 19:02:19,56chgpvqt2w1lpjyq2ou65q6kdppad3vyngwfj79oiaru98yn6,01062,No,,30,Female,Live with partner/spouse,White,Not Hispanic or Latino or Spanish Origin,None of the above,Yes,No,No,No,No,No,No,No,No,,,No,,,Employed: Working 40 or more hrs per week,Computer and Mathematical,01035,No,,No
huB196BF,3/23/2020 19:02:52,2jip3x59ovllf5dncx8w5eu585ysjnl7dgw0tpm6tbkv2q9jvs,47401,No,,72,Male,Live with partner/spouse,White,Not Hispanic or Latino or Spanish Origin,None of the above,No,No,No,No,No,No,No,No,Yes,No,Don't currently smoke,No,,,Retired,,,,,